Severnaya Osetiya, Respublika
type: Class
alternative label: RU+SE
subclass of: R53E5e3A8871d86E4f7D1166
hidden label: RU+SE
definition: Severnaya Osetiya, Respublika is a region within the Russian Federation.