Sverdlovskaya oblast'
type: Class
alternative label: RU+SVE
subclass of: R53E5e3A8871d86E4f7D1166
hidden label: RU+SVE
definition: Sverdlovskaya oblast' refers to a region in the Russian Federation, located within its political subdivisions.