Environment and Natural Resources Division
type: Class
alternative label: 环境和自然资源部门
subclass of: R0DB70442Cf8b73D9275F14a
hidden label: ENRD
definition: The United States Department of Justice Environment and Natural Resources Division (ENRD) is one of seven litigating components of the U.S. Department of Justice.