Illes Balears
type: Class
alternative label: ES+IB
subclass of: RF95ef1504aa5B11cfeC5e43
hidden label: ES+IB
definition: Illes Balears refers to the Balearic Islands, an autonomous community of Spain located in the western Mediterranean Sea.