Kansas State Courts
type: Class
alternative label: KS
subclass of: R1F4dbe4CD17b3B2a7f15b97
hidden label: KS
definition: Kansas State Courts are the judicial branch of the government of the state of Kansas, responsible for interpreting and upholding the laws of the state.