Kinmen
type: Class
alternative label: TW+KIN
subclass of: R91D98b850c3219Ceab1E7a3
hidden label: TW+KIN
definition: Kinmen is a small group of islands located off the coast of Taiwan, officially governed by Taiwan as a county.