Murang'a
type: Class
alternative label: KE+29
subclass of: R888ccd914a7eAC7d68FC0db
hidden label: KE+29
definition: Murang'a is a location in Kenya, specifically a county in the central region of the country.