Office of the National Counterintelligence Executive
type: Class
alternative label: 国家反间谍执行官办公室
subclass of: RD52b814FA8ecEB75af4B708
hidden label: NCIX
definition: The Office of the National Counterintelligence Executive (ONCIX) leads national counterintelligence (CI) for the United States government and serves as the director of the National Counterintelligence and Security Center under the Office of the Director of National Intelligence (ODNI).