U.S. Public Health Service
type: Class
alternative label: 美国公共卫生服务
subclass of: RDA5e5cC4E75f969fbe25383
hidden label: USPHS
definition: The mission of the U.S. Public Health Service Commissioned Corps is to protect, promote, and advance the health and safety of the United States.