District of Columbia Courts
type: Class
alternative label: DC
subclass of: R1F4dbe4CD17b3B2a7f15b97
hidden label: DC
definition: District of Columbia Courts are the judicial branch of the District of Columbia government, responsible for administering justice and resolving legal disputes within the District.