U.S. Army Reserve
type: Class
alternative label: 美国陆军预备役
subclass of: R7C48e31DB25e6A076a7459d
hidden label: USAR
definition: The United States Army Reserve (USAR) is the reserve force of the United States Army.