Dagestan, Respublika
type: Class
alternative label: RU+DA
subclass of: R53E5e3A8871d86E4f7D1166
hidden label: RU+DA
definition: A federal subject of Russia located in the North Caucasus region, bordered by the Caspian Sea to the east and Georgia to the south.