U.S. Election Assistance Commission
type: Class
alternative label: 美国选举援助委员会
subclass of: R22815eC3Af3bFF0d002Ca58
hidden label: EAC
definition: The Election Assistance Commission (EAC) is an independent agency of the United States government. The Commission serves as a national clearinghouse and resource of information regarding election administration.