WC440 Hearing Preparation and Support
type: Class
subclass of: R6P7wyMvVTo6CR9AJqe-HSg
definition: Preparing for hearing, Identifying documents/evidence for use at hearing, Preparing demonstrative materials, evidence and exhibits, Pre-hearing conference with adjuster/employer /opposing counsel/witness, Research of case law and statutes for use at hearing, Review of deposition for use at hearing, Preparation of trial summary memorandum of law, Preparation of opening/closing statement