Texas County Court - Hidalgo County
type: Class
subclass of: RB4oCa7F90YQShNxWl4ZgkW
definition: A court located in Hidalgo County, Texas that has jurisdiction over certain legal matters within the county.