U.S. Federal Agencies
type: Class
preferred label: Federal Agencies
alternative label: 美国联邦机构
subclass of: R9o0sZT3FdlEsNm24CtqmNJ
hidden label: FD
definition: U.S. Federal agencies includes legislative, judicial and executive brach departments and agencies. It also includes Special Inspector General Office and quasi-official agencies.