DEPRECATED - Material Adverse Effect Definition - Applies to Target's Prospects
type: Class
alternative label: 实质性不利影响定义-适用于目标前景
subclass of: R8H8cpx25KBk3kH55YwSdDv
definition: SUPERCEDED BY ACQUIROR AND ACQUIREE TAGS. A Material Adverse Effect (MAE) Definition - Applies to Target Prospects is a term used in legal matters to describe a negative change or event that significantly impacts the future prospects or potential of a specific target company or entity.