Euro
type: Class
alternative label: यूरो
subclass of: R767niCLQVC5zIcO5WDQMSl
hidden label: EUR
definition: Locations used: Åland Islands(AX), European Union(EU), Andorra(AD), Austria(AT), Belgium(BE), Cyprus(CY), Estonia(EE), Finland(FI), France(FR), French Southern and Antarctic Lands(TF), Germany(DE), Greece(GR), Guadeloupe(GP), Ireland(IE), Italy