Defense Security Cooperation Agency
type: Class
alternative label: 国防安全合作局
subclass of: RF52f1c417a596A01b36Bcf0
hidden label: DSCA
definition: The Defense Security Cooperation Agency (DSCA), as part of the United States Department of Defense (DoD), provides financial and technical assistance, transfer of defense mat'riel, training and services to allies, and promotes military-to-military contacts.