Delay Rentals Clause
type: Class
alternative label: 滞纳金条款
subclass of: RDe0RKU39BlhcyACJW30ZLc
definition: A Delay Rentals Clause is a provision in a contract that requires one party to pay a specified amount of money to the other party if there is a delay in the performance of the contract.