Charter
type: Class
preferred label: Corporate Charter
subclass of: RCBtDyjzrPbQyhvU5V64Irn
definition: A Charter is a formal document that establishes an organization, specifying its purpose, structure, and basic operating principles. It sets the entity's foundational governance structure.