X201 Patent and Trademark Records
type: Class
subclass of: RK0ttjFyyS0ytN62EJVzSZg
definition: Any costs for obtaining patent copies, priority documents, file histories and other intellectual property records