Abstract of Judgment
type: Class
alternative label: 判决摘要
subclass of: R8zijLH2GH0SxOhIdzeDOs3
definition: An Abstract of Judgment is a written summary of a court's final decision in a legal case, including the amount of money owed by the losing party.