Agreement in Full Force and Effect Clause
type: Class
alternative label: 完全生效协议条款
subclass of: RDe0RKU39BlhcyACJW30ZLc
definition: An Agreement in Full Force and Effect Clause is a provision in a contract that states that the agreement is valid and enforceable according to its terms.