New Mexico Magistrate Court - Guadalupe County
type: Class
subclass of: RDSK8CbOPdmMwMyMIlw8pdO
definition: A court located in Guadalupe County, New Mexico that has limited jurisdiction over certain types of cases.