Georgia District Court - Fulton County Traf. Viol. Bd.
type: Class
subclass of: RBxw7BF15bDA0Ifn2vOrC8h
definition: A specialized court in Fulton County, Georgia that handles traffic violations and is a part of the larger Georgia District Court system.