Special Inspector General for the Troubled Asset Relief Program
type: Class
alternative label: 特别监察员负责烦扰资产救助计划
subclass of: RAA299e70Ea01E3Ba1dBAe8f
hidden label: SIGTARP
definition: The Office of the Special Inspector General for the Troubled Asset Relief Program (SIGTARP) is a federal law enforcement agency and an independent audit watchdog that targets financial institution crime and other fraud, waste, and abuse related to TARP