Red Sea
type: Class
alternative label: SD+RS
subclass of: R7D2a4a5B3d44C416dfF6ba8
hidden label: SD+RS
definition: The Red Sea is a body of water located between Africa and Asia, bordered by Sudan to the west.