Office of Management and Budget
type: Class
alternative label: 管理和预算办公室
subclass of: R676b6191E8c9FC88c4B1f51
hidden label: OMB
definition: The Office of Management and Budget (OMB) is the largest office within the Executive Office of the President of the United States (EOP).