Georgia Superior Court - Twiggs County
type: Class
subclass of: RCBE5bLTCIia7wAstjMsnKO
definition: Georgia Superior Court - Twiggs County is a specific court within the Georgia Superior Court system that has jurisdiction over legal matters within Twiggs County.