European Monetary Unit
type: Class
preferred label: European Monetary Unit(E.M.U.-6)(bond market unit)
alternative label: यूरोपीय मुद्रा इकाई
subclass of: R767niCLQVC5zIcO5WDQMSl
hidden label: XBB
definition: A European Monetary Unit (E.M.U.-6) is a bond market unit within the Currency ontology, used for standardization and exchange of money in the European Union.