Kurskaya oblast'
type: Class
alternative label: RU+KRS
subclass of: R53E5e3A8871d86E4f7D1166
hidden label: RU+KRS
definition: Kurskaya oblast' refers to a region within the Russian Federation, specifically located within its political subdivisions.