Extension of Term Clause
type: Class
alternative label: 期限延长条款
subclass of: RFanQiAnBUnqQS4PNIuJao
definition: An Extension of Term Clause is a provision in a contract that allows for the lengthening of a specified period of time beyond its original expiration date.