Grand Jury
type: Class
alternative label: 大陪审团
subclass of: R9pwejG33H0Y9mi74WzE2nb
definition: A court-impaneled body of jurors that hears and examines evidence concerning alleged criminal offenses and misconduct, examining the validity of those accusations.