Florida Circuit Court
type: Class
subclass of: R97075cD0123f97C9e3AC116
definition: The Florida Circuit Court is a state court in Florida that has jurisdiction over civil and criminal cases within its designated circuit.