Motion to Determine Tax Liability
type: Class
alternative label: 确定税务责任动议
subclass of: R9Ii4OzSADsjS0VegX12oQJ
definition: A Motion to Determine Tax Liability is a legal request made in a bankruptcy case to determine the amount of taxes owed by the debtor.