Prehearing Conference
type: Class
alternative label: 庭前会议
subclass of: R73Uo5x4VyfiOXt6i4R256t
definition: A Prehearing Conference is a litigation event that occurs before a hearing, where the parties and the judge discuss the case and attempt to resolve any issues or streamline the hearing process.