Supplemental Appendix
type: Class
alternative label: 补充附录
subclass of: RDkB4hqzLrfXeDv4AyntCzX
definition: A Supplemental Appendix is an additional section of a document or report that provides further information or data beyond what is included in the main body of the Appendix.