New York Town Court
type: Class
subclass of: R3391bdB1A2adE51071C7cf7
definition: New York Town Court is a court of limited jurisdiction within the New York State Courts system that handles minor civil and criminal matters at the local level.