Alabama State Courts
type: Class
alternative label: AL
subclass of: R1F4dbe4CD17b3B2a7f15b97
hidden label: AL
definition: Alabama State Courts are the judicial system of the state of Alabama, including the Alabama Supreme Court and lower courts such as the Alabama Court of Criminal Appeals and Alabama Court of Civil Appeals.