Indiana Superior Court - Dearborn County
type: Class
subclass of: R7uq2Mq8qLUybQoDhVczzZ5
definition: A court of general jurisdiction in Indiana that has the power to hear and decide a wide range of legal cases within Dearborn County.