Office of Trade and Labor Affairs
type: Class
alternative label: 贸易和劳工事务办公室
subclass of: R15Bf89EBBcdd05Ca4462a0b
hidden label: OTLA
definition: The Office of Trade and Labor Affairs (OTLA) within the Bureau of International Labor Affairs is responsible for overseeing the labor provisions in U.S. free trade agreements (FTAs) on behalf of the US Labor Department.