Centers for Medicare and Medicaid Services
type: Class
alternative label: 美国医疗保险和医疗补助服务中心
subclass of: RDA5e5cC4E75f969fbe25383
hidden label: CMS
definition: The Centers for Medicare & Medicaid Services (CMS), previously known as the Health Care Financing Administration (HCFA), is a federal agency within the United States Department of Health and Human Services (HHS) that administers the Medicare program and works in partnership with state governments to administer Medicaid, the Children's Health Insurance Program (CHIP), and health insurance portability standards.