Moheli
type: Class
alternative label: KM+M
subclass of: R8E26e2B7Aa687AFe167203f
hidden label: KM+M
definition: Moheli is an island and one of the three islands that make up the Union of the Comoros, located in the Indian Ocean.