DOL Administrative Review Board
type: Class
preferred label: Department of Labor Administrative Review Board
alternative label: 美国劳工部行政复议委员会
subclass of: R15Bf89EBBcdd05Ca4462a0b
hidden label: DOLARB
definition: The Administrative Review Board issues final agency decisions for the Secretary of Labor in cases arising under a wide range of worker protection laws, primarily involving environmental, transportation, and securities whistleblower protection; H-1B immigration provisions; child labor; employment discrimination; job training; seasonal and migrant workers; and federal construction and service contracts.