Southern Province
type: Class
alternative label: LK+3
subclass of: R809251398667B57ce80A123
hidden label: LK+3
definition: Southern Province refers to a political subdivision in Sri Lanka located in the southern region of the country.