CFA franc BEAC
type: Class
alternative label: सीएफए फ्रैंक बीईएसी एस
subclass of: R767niCLQVC5zIcO5WDQMSl
hidden label: XAF
definition: Locations used: Cameroon(CM), Central African Republic(CF), Republic of the Congo(CG), Chad(TD), Equatorial Guinea(GQ), Gabon(GA)