Release of All Claims Clause
type: Class
alternative label: 免除所有索赔条款
subclass of: R7QtA1XEvYBttW8LUvBN7OB
definition: A Release of All Claims Clause is a legal provision that absolves one party from any liability or responsibility for any claims or damages made by the other party, including those that may arise in the future.