Pozesko-slavonska zupanija
type: Class
alternative label: HR+11
subclass of: RD376568768e2A38500CEb1b
hidden label: HR+11
definition: Pozesko-slavonska zupanija is a region in Croatia, which is a political subdivision of the country.