Zambezi
type: Class
alternative label: NA+CA
subclass of: RB8A9f84D36bd918324B5547
hidden label: NA+CA
definition: The Zambezi is a river in Africa that flows through multiple countries, including Namibia.